Reaction Details
TargetBcl-2-related protein A1
LigandBDBM39137
Substrate/Competitorn/a
Meas. Tech.In Vitro Bfl-1 Dose Response Fluorescence Polarization Assay for SAR Study
IC50 3410±170 nM
Citation PubChem, PC In Vitro Bfl-1 Dose Response Fluorescence Polarization Assay for SAR Study PubChem Bioassay(2008)[AID]
 
Bcl-2-related protein A1
Name:Bcl-2-related protein A1
Type:Apoptosis regulator protein
Mol. Mass.:19909.74
Organism:Mus musculus (Mouse)
Description:gi_11024684
Residue:172
BDBM39137
NameBDBM39137
Synonyms:3,4-bis(chloranyl)-1-(3-chlorophenyl)pyrrole-2,5-dione 3,4-dichloro-1-(3-chlorophenyl)pyrrole-2,5-dione cid_729256
TypeSmall organic molecule
Emp. Form.C10H4Cl3NO2
Mol. Mass.276.503
SMILESClC1=C(Cl)C(=O)N(C1=O)c1cccc(Cl)c1