Reaction Details
TargetBcl-2-related protein A1
LigandBDBM39144
Substrate/Competitorn/a
Meas. Tech.In Vitro Bfl-1 Dose Response Fluorescence Polarization Assay for SAR Study
IC50 2150±240 nM
Citation PubChem, PC In Vitro Bfl-1 Dose Response Fluorescence Polarization Assay for SAR Study PubChem Bioassay(2008)[AID]
 
Bcl-2-related protein A1
Name:Bcl-2-related protein A1
Type:Apoptosis regulator protein
Mol. Mass.:19909.74
Organism:Mus musculus (Mouse)
Description:gi_11024684
Residue:172
BDBM39144
NameBDBM39144
Synonyms:3-chloranyl-1-(3-chlorophenyl)-4-(4-methylpiperazin-1-yl)pyrrole-2,5-dione 3-chloro-1-(3-chlorophenyl)-4-(4-methyl-1-piperazinyl)pyrrole-2,5-dione 3-chloro-1-(3-chlorophenyl)-4-(4-methylpiperazino)-3-pyrroline-2,5-quinone MLS-0090834.0001 | cid_720528
TypeSmall organic molecule
Emp. Form.C15H15Cl2N3O2
Mol. Mass.340.205
SMILESCN1CCN(CC1)C1=C(Cl)C(=O)N(C1=O)c1cccc(Cl)c1