Reaction Details
TargetBcl-2-related protein A1
LigandBDBM39159
Substrate/Competitorn/a
Meas. Tech.In Vitro Bfl-1 Dose Response Fluorescence Polarization Assay for SAR Study
IC50 1250±800 nM
Citation PubChem, PC In Vitro Bfl-1 Dose Response Fluorescence Polarization Assay for SAR Study PubChem Bioassay(2008)[AID]
 
Bcl-2-related protein A1
Name:Bcl-2-related protein A1
Type:Apoptosis regulator protein
Mol. Mass.:19909.74
Organism:Mus musculus (Mouse)
Description:gi_11024684
Residue:172
BDBM39159
NameBDBM39159
Synonyms:3-chloranyl-1-(3,4-dichlorophenyl)-4-[4-(4-methoxyphenyl)piperazin-1-yl]pyrrole-2,5-dione 3-chloro-1-(3,4-dichlorophenyl)-4-[4-(4-methoxyphenyl)-1-piperazinyl]pyrrole-2,5-dione 3-chloro-1-(3,4-dichlorophenyl)-4-[4-(4-methoxyphenyl)piperazino]-3-pyrroline-2,5-quinone MLS-0090877.0001 | cid_16654672
TypeSmall organic molecule
Emp. Form.C21H18Cl3N3O3
Mol. Mass.466.745
SMILESCOc1ccc(cc1)N1CCN(CC1)C1=C(Cl)C(=O)N(C1=O)c1ccc(Cl)c(Cl)c1