Reaction Details
TargetBcl-2-related protein A1
LigandBDBM39172
Substrate/Competitorn/a
Meas. Tech.In Vitro Bfl-1 Dose Response Fluorescence Polarization Assay for SAR Study
IC50 565±130 nM
Citation PubChem, PC In Vitro Bfl-1 Dose Response Fluorescence Polarization Assay for SAR Study PubChem Bioassay(2008)[AID]
 
Bcl-2-related protein A1
Name:Bcl-2-related protein A1
Type:Apoptosis regulator protein
Mol. Mass.:19909.74
Organism:Mus musculus (Mouse)
Description:gi_11024684
Residue:172
BDBM39172
NameBDBM39172
Synonyms:3-chloranyl-4-(4-ethylpiperazin-1-yl)-1-(4-nitrophenyl)pyrrole-2,5-dione 3-chloro-4-(4-ethylpiperazin-1-yl)-1-(4-nitrophenyl)pyrrole-2,5-dione MLS-0111725.0001 | cid_16654754
TypeSmall organic molecule
Emp. Form.C16H17ClN4O4
Mol. Mass.364.784
SMILESCCN1CCN(CC1)C1=C(Cl)C(=O)N(C1=O)c1ccc(cc1)[N+]([O-])=O