Reaction Details
TargetBcl-2-related protein A1
LigandBDBM39175
Substrate/Competitorn/a
Meas. Tech.In Vitro Bfl-1 Dose Response Fluorescence Polarization Assay for SAR Study
IC50 9680±1590 nM
Citation PubChem, PC In Vitro Bfl-1 Dose Response Fluorescence Polarization Assay for SAR Study PubChem Bioassay(2008)[AID]
 
Bcl-2-related protein A1
Name:Bcl-2-related protein A1
Type:Apoptosis regulator protein
Mol. Mass.:19909.74
Organism:Mus musculus (Mouse)
Description:gi_11024684
Residue:172
BDBM39175
NameBDBM39175
Synonyms:3-chloranyl-4-morpholin-4-yl-1-(3-nitrophenyl)pyrrole-2,5-dione 3-chloro-4-morpholin-4-yl-1-(3-nitrophenyl)pyrrole-2,5-dione MLS-0111738.0001 | cid_1654665
TypeSmall organic molecule
Emp. Form.C14H12ClN3O5
Mol. Mass.337.715
SMILES[O-][N+](=O)c1cccc(c1)N1C(=O)C(Cl)=C(N2CCOCC2)C1=O