Reaction Details
TargetBcl-2-related protein A1
LigandBDBM39176
Substrate/Competitorn/a
Meas. Tech.In Vitro Bfl-1 Dose Response Fluorescence Polarization Assay for SAR Study
IC50 6790±1390 nM
Citation PubChem, PC In Vitro Bfl-1 Dose Response Fluorescence Polarization Assay for SAR Study PubChem Bioassay(2008)[AID]
 
Bcl-2-related protein A1
Name:Bcl-2-related protein A1
Type:Apoptosis regulator protein
Mol. Mass.:19909.74
Organism:Mus musculus (Mouse)
Description:gi_11024684
Residue:172
BDBM39176
NameBDBM39176
Synonyms:3-chloranyl-4-(4-methylpiperazin-1-yl)-1-(3-nitrophenyl)pyrrole-2,5-dione 3-chloro-4-(4-methyl-1-piperazinyl)-1-(3-nitrophenyl)pyrrole-2,5-dione 3-chloro-4-(4-methylpiperazino)-1-(3-nitrophenyl)-3-pyrroline-2,5-quinone MLS-0111745.0001 | cid_16654772
TypeSmall organic molecule
Emp. Form.C15H15ClN4O4
Mol. Mass.350.757
SMILESCN1CCN(CC1)C1=C(Cl)C(=O)N(C1=O)c1cccc(c1)[N+]([O-])=O