Reaction Details
TargetHeat shock 70 kDa protein 1A
LigandBDBM31725
Substrate/Competitorn/a
Meas. Tech.In Vitro Hsp70 Dose Response Fluorescence Polarization Assay for SAR Study
IC50 7140±1120 nM
Citation PubChem, PC In Vitro Hsp70 Dose Response Fluorescence Polarization Assay for SAR Study PubChem Bioassay(2008)[AID]
 
Heat shock 70 kDa protein 1A
Name:Heat shock 70 kDa protein 1A
Type:ATP-binding protein
Mol. Mass.:51937.99
Organism:Homo sapiens (Human)
Description:gi_123271505; GST-tagged ATPase domain
Residue:476
BDBM31725
NameBDBM31725
Synonyms:3a,4,5,9b-tetrahydro-3H-cyclopenta[c]quinoline-4-carboxylic acid US20230364057, Compound 83 | cid_3124342
TypeSmall organic molecule
Emp. Form.C13H13NO2
Mol. Mass.215.2478
SMILESOC(=O)C1Nc2ccccc2C2C=CCC12