Reaction Details
TargetHeat shock 70 kDa protein 1A
LigandBDBM31729
Substrate/Competitorn/a
Meas. Tech.In Vitro Hsp70 Dose Response Fluorescence Polarization Assay for SAR Study
IC50 3240±370 nM
Citation PubChem, PC In Vitro Hsp70 Dose Response Fluorescence Polarization Assay for SAR Study PubChem Bioassay(2008)[AID]
 
Heat shock 70 kDa protein 1A
Name:Heat shock 70 kDa protein 1A
Type:ATP-binding protein
Mol. Mass.:51937.99
Organism:Homo sapiens (Human)
Description:gi_123271505; GST-tagged ATPase domain
Residue:476
BDBM31729
NameBDBM31729
Synonyms:8-bromanyl-3a,4,5,9b-tetrahydro-3H-cyclopenta[c]quinoline-4-carboxylic acid CHEMBL201289 cid_3136927
TypeSmall organic molecule
Emp. Form.C13H12BrNO2
Mol. Mass.294.144
SMILESOC(=O)C1Nc2ccc(Br)cc2C2C=CCC12