Reaction Details
TargetHeat shock 70 kDa protein 1A
LigandBDBM31756
Substrate/Competitorn/a
Meas. Tech.In Vitro Hsp70 Dose Response Fluorescence Polarization Assay for SAR Study
IC50 7180±650 nM
Citation PubChem, PC In Vitro Hsp70 Dose Response Fluorescence Polarization Assay for SAR Study PubChem Bioassay(2008)[AID]
 
Heat shock 70 kDa protein 1A
Name:Heat shock 70 kDa protein 1A
Type:ATP-binding protein
Mol. Mass.:51937.99
Organism:Homo sapiens (Human)
Description:gi_123271505; GST-tagged ATPase domain
Residue:476
BDBM31756
NameBDBM31756
Synonyms:6,7-dimethyl-3a,4,5,9b-tetrahydro-3H-cyclopenta[c]quinoline-4-carboxylic acid cid_646406
TypeSmall organic molecule
Emp. Form.C15H17NO2
Mol. Mass.243.301
SMILESCc1ccc2C3C=CCC3C(Nc2c1C)C(O)=O