Reaction Details
TargetHeat shock 70 kDa protein 1A
LigandBDBM41999
Substrate/Competitorn/a
Meas. Tech.In Vitro Hsp70 Dose Response Fluorescence Polarization Assay for SAR Study
IC50 578±43 nM
Citation PubChem, PC In Vitro Hsp70 Dose Response Fluorescence Polarization Assay for SAR Study PubChem Bioassay(2008)[AID]
 
Heat shock 70 kDa protein 1A
Name:Heat shock 70 kDa protein 1A
Type:ATP-binding protein
Mol. Mass.:51937.99
Organism:Homo sapiens (Human)
Description:gi_123271505; GST-tagged ATPase domain
Residue:476
BDBM41999
NameBDBM41999
Synonyms:3-(3,4,5-trihydroxy-6-keto-xanthen-9-yl)propionic acid 3-(3,4,5-trihydroxy-6-oxoxanthen-9-yl)propanoic acid MLS-0111617.0001 | cid_274127
TypeSmall organic molecule
Emp. Form.C16H12O7
Mol. Mass.316.2623
SMILESOC(=O)CCc1c2ccc(O)c(O)c2oc2c(O)c(=O)ccc12