Reaction Details
TargetGlyceraldehyde-3-phosphate dehydrogenase
LigandBDBM31748
Substrate/Competitorn/a
Meas. Tech.GAPDH Dose Response Colorimetric Assay
IC50 37800±6970 nM
Citation PubChem, PC GAPDH Dose Response Colorimetric Assay PubChem Bioassay(2008)[AID]
 
Glyceraldehyde-3-phosphate dehydrogenase
Name:Glyceraldehyde-3-phosphate dehydrogenase
Type:PROTEIN
Mol. Mass.:36060.86
Organism:Homo sapiens (Human)
Description:ChEMBL_1511315
Residue:335
BDBM31748
NameBDBM31748
Synonyms:8-chloranyl-9-nitro-6-oxidanyl-3a,4,5,9b-tetrahydro-3H-cyclopenta[c]quinoline-4-carboxylic acid MLS-0111541.0001 cid_3453217
TypeSmall organic molecule
Emp. Form.C13H11ClN2O5
Mol. Mass.310.69
SMILESOC(=O)C1Nc2c(O)cc(Cl)c(c2C2C=CCC12)[N+]([O-])=O