Reaction Details
TargetGlyceraldehyde-3-phosphate dehydrogenase
LigandBDBM42073
Substrate/Competitorn/a
Meas. Tech.GAPDH Dose Response Colorimetric Assay
IC50 50100±1820 nM
Citation PubChem, PC GAPDH Dose Response Colorimetric Assay PubChem Bioassay(2008)[AID]
 
Glyceraldehyde-3-phosphate dehydrogenase
Name:Glyceraldehyde-3-phosphate dehydrogenase
Type:PROTEIN
Mol. Mass.:36060.86
Organism:Homo sapiens (Human)
Description:ChEMBL_1511315
Residue:335
BDBM42073
NameBDBM42073
Synonyms:MLS-0111921.0001 N-(5-methyl-3-isoxazolyl)-2-thiophenecarboxamide cid_670281
TypeSmall organic molecule
Emp. Form.C9H8N2O2S
Mol. Mass.208.237
SMILESCc1cc(NC(=O)c2cccs2)no1