Reaction Details
TargetGlyceraldehyde-3-phosphate dehydrogenase
LigandBDBM42074
Substrate/Competitorn/a
Meas. Tech.GAPDH Dose Response Colorimetric Assay
IC50 93800±9640 nM
Citation PubChem, PC GAPDH Dose Response Colorimetric Assay PubChem Bioassay(2008)[AID]
 
Glyceraldehyde-3-phosphate dehydrogenase
Name:Glyceraldehyde-3-phosphate dehydrogenase
Type:PROTEIN
Mol. Mass.:36060.86
Organism:Homo sapiens (Human)
Description:ChEMBL_1511315
Residue:335
BDBM42074
NameBDBM42074
Synonyms:MLS-0111922.0001 N-(5-methyl-1,2-oxazol-3-yl)-2-(4-methylphenyl)ethanamide N-(5-methylisoxazol-3-yl)-2-(p-tolyl)acetamide | cid_889538
TypeSmall organic molecule
Emp. Form.C13H14N2O2
Mol. Mass.230.2625
SMILESCc1cc(NC(=O)Cc2ccc(C)cc2)no1