Reaction Details
TargetGalanin receptor type 2
LigandBDBM42045
Substrate/Competitorn/a
Meas. Tech.Dose response counterscreen for antagonists of galanin receptor 2 (GalR2): a cell-based high-throughput screening assay for inhibitors of beta-lactamase activity
IC50 17070±n/a nM
Citation PubChem, PC Dose response counterscreen for antagonists of galanin receptor 2 (GalR2): a cell-based high-throughput screening assay for inhibitors of beta-lactamase activity PubChem Bioassay(2008)[AID]
 
Galanin receptor type 2
Name:Galanin receptor type 2
Type:Enzyme Catalytic Domain
Mol. Mass.:41724.40
Organism:Homo sapiens (Human)
Description:Galanin R2 GALR2 HUMAN::O43603
Residue:387
BDBM42045
NameBDBM42045
Synonyms:MLS000554273 S-[1-(1-ethanoylindol-3-yl)-2-nitro-ethyl] ethanethioate Thioacetic acid S-[1-(1-acetyl-1H-indol-3-yl)-2-nitro-ethyl] ester ethanethioic acid S-[1-(1-acetyl-3-indolyl)-2-nitroethyl] ester | ethanethioic acid S-[1-(1-acetylindol-3-yl)-2-nitro-ethyl] ester
TypeSmall organic molecule
Emp. Form.C14H14N2O4S
Mol. Mass.306.337
SMILESCC(=O)SC(C[N+]([O-])=O)c1cn(C(C)=O)c2ccccc12