Reaction Details
TargetLysosomal acid glucosylceramidase
LigandBDBM42270
Substrate/Competitorn/a
Meas. Tech.Dose response cell-based high throughput screening assay to identify enhancers of beta-glucosidase activity
EC50>50000±n/a nM
Citation PubChem, PC Dose response cell-based high throughput screening assay to identify enhancers of beta-glucosidase activity PubChem Bioassay(2008)[AID]
 
Lysosomal acid glucosylceramidase
Name:Lysosomal acid glucosylceramidase
Type:Enzyme
Mol. Mass.:59724.64
Organism:Homo sapiens (Human)
Description:The beta-Glu activity was measured with commercially available beta-glucocerebrosidase (Ceredase) as the enzyme source.
Residue:536
BDBM42270
NameBDBM42270
Synonyms:8-(2-Piperidin-1-yl-propane-1-sulfonyl)-quinoline 8-(2-piperidinopropylsulfonyl)quinoline MLS000029906 cid_646121
TypeSmall organic molecule
Emp. Form.C17H22N2O2S
Mol. Mass.318.434
SMILESCC(CS(=O)(=O)c1cccc2cccnc12)N1CCCCC1