Reaction Details
TargetLysosomal acid glucosylceramidase
LigandBDBM42363
Substrate/Competitorn/a
Meas. Tech.Dose response cell-based high throughput screening assay to identify enhancers of beta-glucosidase activity
EC50>10000±n/a nM
Citation PubChem, PC Dose response cell-based high throughput screening assay to identify enhancers of beta-glucosidase activity PubChem Bioassay(2008)[AID]
 
Lysosomal acid glucosylceramidase
Name:Lysosomal acid glucosylceramidase
Type:Enzyme
Mol. Mass.:59724.64
Organism:Homo sapiens (Human)
Description:The beta-Glu activity was measured with commercially available beta-glucocerebrosidase (Ceredase) as the enzyme source.
Residue:536
BDBM42363
NameBDBM42363
Synonyms:4-(3-benzyl-4-keto-2-thioxo-1H-quinazoline-7-carbonyl)piperazine-1-carboxylic acid ethyl ester MLS000044077 cid_3243888 ethyl 4-[(3-benzyl-4-oxo-2-thioxo-1,2,3,4-tetrahydroquinazolin-7-yl)carbonyl]piperazine-1-carboxylate | ethyl 4-[[4-oxidanylidene-3-(phenylmethyl)-2-sulfanylidene-1H-quinazolin-7-yl]carbonyl]piperazine-1-carboxylate
TypeSmall organic molecule
Emp. Form.C23H24N4O4S
Mol. Mass.452.526
SMILESCCOC(=O)N1CCN(CC1)C(=O)c1ccc2c(c1)[nH]c(=S)n(Cc1ccccc1)c2=O