Reaction Details
TargetLysosomal acid glucosylceramidase
LigandBDBM42368
Substrate/Competitorn/a
Meas. Tech.Dose response cell-based high throughput screening assay to identify enhancers of beta-glucosidase activity
EC50>10000±n/a nM
Citation PubChem, PC Dose response cell-based high throughput screening assay to identify enhancers of beta-glucosidase activity PubChem Bioassay(2008)[AID]
 
Lysosomal acid glucosylceramidase
Name:Lysosomal acid glucosylceramidase
Type:Enzyme
Mol. Mass.:59724.64
Organism:Homo sapiens (Human)
Description:The beta-Glu activity was measured with commercially available beta-glucocerebrosidase (Ceredase) as the enzyme source.
Residue:536
BDBM42368
NameBDBM42368
Synonyms:2-(1-keto-3-methyl-2-isoquinolyl)-N-[2-keto-2-(4-phenylpiperazino)ethyl]acetamide 2-(3-methyl-1-oxo-2-isoquinolinyl)-N-[2-oxo-2-(4-phenyl-1-piperazinyl)ethyl]acetamide MLS000095015 cid_3244436
TypeSmall organic molecule
Emp. Form.C24H26N4O3
Mol. Mass.418.4882
SMILESCc1cc2ccccc2c(=O)n1CC(=O)NCC(=O)N1CCN(CC1)c1ccccc1