Reaction Details
TargetLysosomal acid glucosylceramidase
LigandBDBM42374
Substrate/Competitorn/a
Meas. Tech.Dose response cell-based high throughput screening assay to identify enhancers of beta-glucosidase activity
EC50>10000±n/a nM
Citation PubChem, PC Dose response cell-based high throughput screening assay to identify enhancers of beta-glucosidase activity PubChem Bioassay(2008)[AID]
 
Lysosomal acid glucosylceramidase
Name:Lysosomal acid glucosylceramidase
Type:Enzyme
Mol. Mass.:59724.64
Organism:Homo sapiens (Human)
Description:The beta-Glu activity was measured with commercially available beta-glucocerebrosidase (Ceredase) as the enzyme source.
Residue:536
BDBM42374
NameBDBM42374
Synonyms:2-(3-keto-1,4-benzothiazin-4-yl)acetic acid ethyl ester MLS000095979 cid_3245459 ethyl 2-(3-oxidanylidene-1,4-benzothiazin-4-yl)ethanoate | ethyl 2-(3-oxo-1,4-benzothiazin-4-yl)acetate
TypeSmall organic molecule
Emp. Form.C12H13NO3S
Mol. Mass.251.302
SMILESCCOC(=O)CN1C(=O)CSc2ccccc12