Reaction Details
TargetLysosomal acid glucosylceramidase
LigandBDBM39489
Substrate/Competitorn/a
Meas. Tech.Dose response cell-based high throughput screening assay to identify enhancers of beta-glucosidase activity
EC50>10000±n/a nM
Citation PubChem, PC Dose response cell-based high throughput screening assay to identify enhancers of beta-glucosidase activity PubChem Bioassay(2008)[AID]
 
Lysosomal acid glucosylceramidase
Name:Lysosomal acid glucosylceramidase
Type:Enzyme
Mol. Mass.:59724.64
Organism:Homo sapiens (Human)
Description:The beta-Glu activity was measured with commercially available beta-glucocerebrosidase (Ceredase) as the enzyme source.
Residue:536
BDBM39489
NameBDBM39489
Synonyms:1-(3-chlorophenyl)-3-[4-(cyanomethyl)phenyl]urea N-(3-chlorophenyl)-N'-[4-(cyanomethyl)phenyl]urea cid_1255527
TypeSmall organic molecule
Emp. Form.C15H12ClN3O
Mol. Mass.285.728
SMILESClc1cccc(NC(=O)Nc2ccc(CC#N)cc2)c1