Reaction Details
TargetLysosomal acid glucosylceramidase
LigandBDBM42388
Substrate/Competitorn/a
Meas. Tech.Dose response cell-based high throughput screening assay to identify enhancers of beta-glucosidase activity
EC50>10000±n/a nM
Citation PubChem, PC Dose response cell-based high throughput screening assay to identify enhancers of beta-glucosidase activity PubChem Bioassay(2008)[AID]
 
Lysosomal acid glucosylceramidase
Name:Lysosomal acid glucosylceramidase
Type:Enzyme
Mol. Mass.:59724.64
Organism:Homo sapiens (Human)
Description:The beta-Glu activity was measured with commercially available beta-glucocerebrosidase (Ceredase) as the enzyme source.
Residue:536
BDBM42388
NameBDBM42388
Synonyms:MLS000254533 N-(2-cyclohexylsulfanylethyl)-2-[1,1,3-tris(oxidanylidene)-1,2-benzothiazol-2-yl]ethanamide N-[2-(cyclohexylthio)ethyl]-2-(1,1,3-trioxo-1,2-benzothiazol-2-yl)acetamide SMR000074801 | cid_1994454
TypeSmall organic molecule
Emp. Form.C17H22N2O4S2
Mol. Mass.382.498
SMILESO=C(CN1C(=O)c2ccccc2S1(=O)=O)NCCSC1CCCCC1