Reaction Details
TargetLysosomal acid glucosylceramidase
LigandBDBM42402
Substrate/Competitorn/a
Meas. Tech.Dose response cell-based high throughput screening assay to identify enhancers of beta-glucosidase activity
EC50>10000±n/a nM
Citation PubChem, PC Dose response cell-based high throughput screening assay to identify enhancers of beta-glucosidase activity PubChem Bioassay(2008)[AID]
 
Lysosomal acid glucosylceramidase
Name:Lysosomal acid glucosylceramidase
Type:Enzyme
Mol. Mass.:59724.64
Organism:Homo sapiens (Human)
Description:The beta-Glu activity was measured with commercially available beta-glucocerebrosidase (Ceredase) as the enzyme source.
Residue:536
BDBM42402
NameBDBM42402
Synonyms:(3aS,4S,9bS)-8-methyl-4-(4-pyridyl)-2,3,3a,4,5,9b-hexahydrofuro[3,2-c]quinoline MLS000115006 cid_5308449
TypeSmall organic molecule
Emp. Form.C17H18N2O
Mol. Mass.266.3376
SMILESCc1ccc2N[C@@H]([C@@H]3CCO[C@@H]3c2c1)c1ccncc1