Reaction Details
TargetLysosomal acid glucosylceramidase
LigandBDBM42404
Substrate/Competitorn/a
Meas. Tech.Dose response cell-based high throughput screening assay to identify enhancers of beta-glucosidase activity
EC50>10000±n/a nM
Citation PubChem, PC Dose response cell-based high throughput screening assay to identify enhancers of beta-glucosidase activity PubChem Bioassay(2008)[AID]
 
Lysosomal acid glucosylceramidase
Name:Lysosomal acid glucosylceramidase
Type:Enzyme
Mol. Mass.:59724.64
Organism:Homo sapiens (Human)
Description:The beta-Glu activity was measured with commercially available beta-glucocerebrosidase (Ceredase) as the enzyme source.
Residue:536
BDBM42404
NameBDBM42404
Synonyms:1-(3,4-dimethoxybenzoyl)-N-(3-methylphenyl)piperidine-4-carboxamide 1-[(3,4-dimethoxyphenyl)-oxomethyl]-N-(3-methylphenyl)-4-piperidinecarboxamide N-(m-tolyl)-1-veratroyl-isonipecotamide cid_1327311
TypeSmall organic molecule
Emp. Form.C22H26N2O4
Mol. Mass.382.4528
SMILESCOc1ccc(cc1OC)C(=O)N1CCC(CC1)C(=O)Nc1cccc(C)c1