Reaction Details
TargetNuclear receptor coactivator 1
LigandBDBM42995
Substrate/Competitorn/a
Meas. Tech.Dose response biochemical High Throughput Screening assay for agonists of the steroid receptor coactivator 1 (SRC-1) recruitment by the peroxisome proliferator-activated receptor gamma (PPARgamma)
EC50 2941±n/a nM
Citation PubChem, PC Dose response biochemical High Throughput Screening assay for agonists of the steroid receptor coactivator 1 (SRC-1) recruitment by the peroxisome proliferator-activated receptor gamma (PPARgamma) PubChem Bioassay(2008)[AID]
 
Nuclear receptor coactivator 1
Name:Nuclear receptor coactivator 1
Type:PROTEIN
Mol. Mass.:156749.34
Organism:Homo sapiens (Human)
Description:ChEMBL_759690
Residue:1441
BDBM42995
NameBDBM42995
Synonyms:2-(2-Adamantan-1-yl-2-oxo-ethylsulfanyl)-6-amino-4-(4-chloro-phenyl)-pyridine-3,5-dicarbonitrile 2-[2-(1-adamantyl)-2-oxoethyl]sulfanyl-6-amino-4-(4-chlorophenyl)pyridine-3,5-dicarbonitrile 2-[[2-(1-adamantyl)-2-oxoethyl]thio]-6-amino-4-(4-chlorophenyl)pyridine-3,5-dicarbonitrile SMR000146155 | cid_3767937
TypeSmall organic molecule
Emp. Form.C25H23ClN4OS
Mol. Mass.462.994
SMILES[H]C12CC3([H])CC([H])(C1)CC(C2)(C3)C(=O)CSc1nc(N)c(C#N)c(-c2ccc(Cl)cc2)c1C#N