Reaction Details
TargetNuclear receptor coactivator 1
LigandBDBM43015
Substrate/Competitorn/a
Meas. Tech.Dose response biochemical High Throughput Screening assay for agonists of the steroid receptor coactivator 1 (SRC-1) recruitment by the peroxisome proliferator-activated receptor gamma (PPARgamma)
EC50 25780±n/a nM
Citation PubChem, PC Dose response biochemical High Throughput Screening assay for agonists of the steroid receptor coactivator 1 (SRC-1) recruitment by the peroxisome proliferator-activated receptor gamma (PPARgamma) PubChem Bioassay(2008)[AID]
 
Nuclear receptor coactivator 1
Name:Nuclear receptor coactivator 1
Type:PROTEIN
Mol. Mass.:156749.34
Organism:Homo sapiens (Human)
Description:ChEMBL_759690
Residue:1441
BDBM43015
NameBDBM43015
Synonyms:2-Ethoxy-6-phenyl-3-(5-thiophen-2-yl-[1,2,4]oxadiazol-3-yl)-pyridine 3-(2-ethoxy-6-phenyl-3-pyridyl)-5-(2-thienyl)-1,2,4-oxadiazole 3-(2-ethoxy-6-phenylpyridin-3-yl)-5-thiophen-2-yl-1,2,4-oxadiazole SMR000148781 | cid_852900
TypeSmall organic molecule
Emp. Form.C19H15N3O2S
Mol. Mass.349.406
SMILESCCOc1nc(ccc1-c1noc(n1)-c1cccs1)-c1ccccc1