Reaction Details
TargetNuclear receptor coactivator 1
LigandBDBM43097
Substrate/Competitorn/a
Meas. Tech.Dose response biochemical High Throughput Screening assay for agonists of the steroid receptor coactivator 1 (SRC-1) recruitment by the peroxisome proliferator-activated receptor gamma (PPARgamma)
EC50 21570±n/a nM
Citation PubChem, PC Dose response biochemical High Throughput Screening assay for agonists of the steroid receptor coactivator 1 (SRC-1) recruitment by the peroxisome proliferator-activated receptor gamma (PPARgamma) PubChem Bioassay(2008)[AID]
 
Nuclear receptor coactivator 1
Name:Nuclear receptor coactivator 1
Type:PROTEIN
Mol. Mass.:156749.34
Organism:Homo sapiens (Human)
Description:ChEMBL_759690
Residue:1441
BDBM43097
NameBDBM43097
Synonyms:3-chloro-1-benzothiophene-2-carboxylic acid [2-[(3,5-dichloro-2-pyridinyl)amino]-2-oxoethyl] ester MLS000390240 [2-[(3,5-dichloropyridin-2-yl)amino]-2-oxoethyl] 3-chloro-1-benzothiophene-2-carboxylate cid_2339538
TypeSmall organic molecule
Emp. Form.C16H9Cl3N2O3S
Mol. Mass.415.678
SMILESClc1c(sc2ccccc12)C(=O)OCC(=O)Nc1ncc(Cl)cc1Cl