Reaction Details
TargetCyclin-dependent kinase 7
LigandBDBM32356
Substrate/Competitorn/a
Meas. Tech.CDK7 counterscreen of confirmed PKD inhibitors-57K library addition
IC50>100000±n/a nM
Citation PubChem, PC CDK7 counterscreen of confirmed PKD inhibitors-57K library addition PubChem Bioassay(2008)[AID]
 
Cyclin-dependent kinase 7
Name:Cyclin-dependent kinase 7
Type:Enzyme Subunit
Mol. Mass.:39047.01
Organism:Homo sapiens (Human)
Description:n/a
Residue:346
BDBM32356
NameBDBM32356
Synonyms:2-amino-6-chloro-4-methyl-3,5-pyridinedicarbonitrile 2-amino-6-chloro-4-methylpyridine-3,5-dicarbonitrile MLS000692177 cid_606000
TypeSmall organic molecule
Emp. Form.C8H5ClN4
Mol. Mass.192.605
SMILESCc1c(C#N)c(N)nc(Cl)c1C#N