Reaction Details
TargetCyclin-dependent kinase 7
LigandBDBM32358
Substrate/Competitorn/a
Meas. Tech.CDK7 counterscreen of confirmed PKD inhibitors-57K library addition
IC50>100000±n/a nM
Citation PubChem, PC CDK7 counterscreen of confirmed PKD inhibitors-57K library addition PubChem Bioassay(2008)[AID]
 
Cyclin-dependent kinase 7
Name:Cyclin-dependent kinase 7
Type:Enzyme Subunit
Mol. Mass.:39047.01
Organism:Homo sapiens (Human)
Description:n/a
Residue:346
BDBM32358
NameBDBM32358
Synonyms:2-chloro-5-(1-piperidinylsulfonyl)benzoic acid [2-[[(1-methyl-2-pyrrolyl)-oxomethyl]amino]-2-oxoethyl] ester MLS001002843 [2-[(1-methylpyrrol-2-yl)carbonylamino]-2-oxidanylidene-ethyl] 2-chloranyl-5-piperidin-1-ylsulfonyl-benzoate cid_2438071
TypeSmall organic molecule
Emp. Form.C20H22ClN3O6S
Mol. Mass.467.923
SMILESCn1cccc1C(=O)NC(=O)COC(=O)c1cc(ccc1Cl)S(=O)(=O)N1CCCCC1