Reaction Details
TargetDNA-directed RNA polymerase subunit beta
LigandBDBM43306
Substrate/Competitorn/a
Meas. Tech.RNA polymerase SAR
IC50 17254±n/a nM
Citation PubChem, PC RNA polymerase SAR PubChem Bioassay(2008)[AID]
 
DNA-directed RNA polymerase subunit beta
Name:DNA-directed RNA polymerase subunit beta
Synonyms:RNA polymerase beta subunit (EC 2.7.7.6)
Type:Enzyme Catalytic Domain
Mol. Mass.:150595.80
Organism:Escherichia coli
Description:A0A0E2LB94
Residue:1342
BDBM43306
NameBDBM43306
TypeSmall organic molecule
Emp. Form.C16H12FNO3S
Mol. Mass.317.335
SMILESOc1ccc(NS(=O)(=O)c2ccc(F)cc2)c2ccccc12