Reaction Details
TargetE3 ubiquitin-protein ligase Mdm2
LigandBDBM43377
Substrate/Competitorn/a
Meas. Tech.E3 Ligase dose-response_384
EC50 30±n/a nM
Citation PubChem, PC E3 Ligase dose-response_384 PubChem Bioassay(2008)[AID]
 
E3 ubiquitin-protein ligase Mdm2
Name:E3 ubiquitin-protein ligase Mdm2
Type:Oncoprotein
Mol. Mass.:55196.54
Organism:Homo sapiens (Human)
Description:Q00987
Residue:491
BDBM43377
NameBDBM43377
Synonyms:2-[ethyl-[(4-keto-1H-quinazolin-2-yl)methyl]amino]-N-(4-morpholinophenyl)acetamide 2-[ethyl-[(4-oxo-1H-quinazolin-2-yl)methyl]amino]-N-(4-morpholin-4-ylphenyl)acetamide MLS000568833 cid_2107414
TypeSmall organic molecule
Emp. Form.C23H27N5O3
Mol. Mass.421.4922
SMILESCCN(CC(=O)Nc1ccc(cc1)N1CCOCC1)Cc1nc2ccccc2c(=O)[nH]1