Reaction Details
TargetE3 ubiquitin-protein ligase Mdm2
LigandBDBM41066
Substrate/Competitorn/a
Meas. Tech.E3 Ligase dose-response_384
EC50 25000±n/a nM
Citation PubChem, PC E3 Ligase dose-response_384 PubChem Bioassay(2008)[AID]
 
E3 ubiquitin-protein ligase Mdm2
Name:E3 ubiquitin-protein ligase Mdm2
Type:Oncoprotein
Mol. Mass.:55196.54
Organism:Homo sapiens (Human)
Description:Q00987
Residue:491
BDBM41066
NameBDBM41066
Synonyms:8-(3-Methyl-thiophen-2-yl)-8,10,11,12-tetrahydro-7H-benzo[a][4,7]phenanthrolin-9-one 8-(3-methyl-2-thiophenyl)-8,10,11,12-tetrahydro-7H-benzo[a][4,7]phenanthrolin-9-one MLS000566464 cid_619419
TypeSmall organic molecule
Emp. Form.C21H18N2OS
Mol. Mass.346.445
SMILESCc1ccsc1C1Nc2ccc3ncccc3c2C2=C1C(=O)CCC2