Reaction Details
TargetE3 ubiquitin-protein ligase Mdm2
LigandBDBM43392
Substrate/Competitorn/a
Meas. Tech.E3 Ligase dose-response_384
EC50 530±n/a nM
Citation PubChem, PC E3 Ligase dose-response_384 PubChem Bioassay(2008)[AID]
 
E3 ubiquitin-protein ligase Mdm2
Name:E3 ubiquitin-protein ligase Mdm2
Type:Oncoprotein
Mol. Mass.:55196.54
Organism:Homo sapiens (Human)
Description:Q00987
Residue:491
BDBM43392
NameBDBM43392
Synonyms:MLS000578501 N-(4-fluorophenyl)-2-(2-nitrophenyl)sulfonylbenzamide SMR000198501 | cid_1310552
TypeSmall organic molecule
Emp. Form.C19H13FN2O5S
Mol. Mass.400.38
SMILES[O-][N+](=O)c1ccccc1S(=O)(=O)c1ccccc1C(=O)Nc1ccc(F)cc1