Reaction Details
TargetE3 ubiquitin-protein ligase Mdm2
LigandBDBM43483
Substrate/Competitorn/a
Meas. Tech.E3 Ligase dose-response_384
EC50 590±n/a nM
Citation PubChem, PC E3 Ligase dose-response_384 PubChem Bioassay(2008)[AID]
 
E3 ubiquitin-protein ligase Mdm2
Name:E3 ubiquitin-protein ligase Mdm2
Type:Oncoprotein
Mol. Mass.:55196.54
Organism:Homo sapiens (Human)
Description:Q00987
Residue:491
BDBM43483
NameBDBM43483
Synonyms:(3aS,5R,5aR,8aS,9aR)-5,8a-dimethyl-1-methylene-3a,4,5,5a,9,9a-hexahydroazuleno[6,7-b]furan-2,8-dione (3aS,5R,5aR,8aS,9aR)-5,8a-dimethyl-1-methylidene-3a,4,5,5a,9,9a-hexahydroazuleno[6,7-b]furan-2,8-dione MLS000728520 cid_282529
TypeSmall organic molecule
Emp. Form.C15H18O3
Mol. Mass.246.3016
SMILESC[C@@H]1C[C@@H]2OC(=O)C(=C)[C@H]2C[C@@]2(C)[C@H]1C=CC2=O