Reaction Details
TargetWee1-like protein kinase
LigandBDBM36923
Substrate/Competitorn/a
Meas. Tech.Dose Response Cell-based Assay for Inhibitors of Wee1 Degradation
EC50>5527±n/a nM
Citation PubChem, PC Dose Response Cell-based Assay for Inhibitors of Wee1 Degradation PubChem Bioassay(2008)[AID]
 
Wee1-like protein kinase
Name:Wee1-like protein kinase
Type:PROTEIN
Mol. Mass.:71599.12
Organism:Homo sapiens (Human)
Description:ChEMBL_1445054
Residue:646
BDBM36923
NameBDBM36923
Synonyms:(Z)-3,4-bis(benzenesulfonyl)-2-buten-1-ol (Z)-3,4-bis(phenylsulfonyl)but-2-en-1-ol MLS000080860 cid_5389617
TypeSmall organic molecule
Emp. Form.C16H16O5S2
Mol. Mass.352.425
SMILESOC\C=C(\CS(=O)(=O)c1ccccc1)S(=O)(=O)c1ccccc1