Reaction Details
TargetWee1-like protein kinase
LigandBDBM38993
Substrate/Competitorn/a
Meas. Tech.Dose Response Cell-based Assay for Inhibitors of Wee1 Degradation
EC50>49750±n/a nM
Citation PubChem, PC Dose Response Cell-based Assay for Inhibitors of Wee1 Degradation PubChem Bioassay(2008)[AID]
 
Wee1-like protein kinase
Name:Wee1-like protein kinase
Type:PROTEIN
Mol. Mass.:71599.12
Organism:Homo sapiens (Human)
Description:ChEMBL_1445054
Residue:646
BDBM38993
NameBDBM38993
Synonyms:(1Z,3Z)-1,4-bis(butylsulfonyl)buta-1,3-diene SMR000020833 | cid_5286934
TypeSmall organic molecule
Emp. Form.C12H22O4S2
Mol. Mass.294.431
SMILESCCCCS(=O)(=O)\C=C/C=C\S(=O)(=O)CCCC