Reaction Details
TargetG2/mitotic-specific cyclin-B1
LigandBDBM36923
Substrate/Competitorn/a
Meas. Tech.Counterscreen assay for inhibitors of Wee1 degradation: dose response cell-based assay to identify inhibitors of cyclin B degradation
EC50>5527±n/a nM
Citation PubChem, PC Counterscreen assay for inhibitors of Wee1 degradation: dose response cell-based assay to identify inhibitors of cyclin B degradation PubChem Bioassay(2008)[AID]
 
G2/mitotic-specific cyclin-B1
Name:G2/mitotic-specific cyclin-B1
Type:Enzyme Subunit
Mol. Mass.:48340.95
Organism:Homo sapiens (Human)
Description:P14635
Residue:433
BDBM36923
NameBDBM36923
Synonyms:(Z)-3,4-bis(benzenesulfonyl)-2-buten-1-ol (Z)-3,4-bis(phenylsulfonyl)but-2-en-1-ol MLS000080860 cid_5389617
TypeSmall organic molecule
Emp. Form.C16H16O5S2
Mol. Mass.352.425
SMILESOC\C=C(\CS(=O)(=O)c1ccccc1)S(=O)(=O)c1ccccc1