Reaction Details
TargetG2/mitotic-specific cyclin-B1
LigandBDBM43756
Substrate/Competitorn/a
Meas. Tech.Counterscreen assay for inhibitors of Wee1 degradation: dose response cell-based assay to identify inhibitors of cyclin B degradation
EC50>49750±n/a nM
Citation PubChem, PC Counterscreen assay for inhibitors of Wee1 degradation: dose response cell-based assay to identify inhibitors of cyclin B degradation PubChem Bioassay(2008)[AID]
 
G2/mitotic-specific cyclin-B1
Name:G2/mitotic-specific cyclin-B1
Type:Enzyme Subunit
Mol. Mass.:48340.95
Organism:Homo sapiens (Human)
Description:P14635
Residue:433
BDBM43756
NameBDBM43756
Synonyms:MLS000526502 N-cyclohexyl-2-(3-ethoxy-N-(1-oxo-2-thiophen-2-ylethyl)anilino)-2-(1-methyl-2-pyrrolyl)acetamide N-cyclohexyl-2-(3-ethoxy-N-[2-(2-thienyl)acetyl]anilino)-2-(1-methylpyrrol-2-yl)acetamide SMR000116976 | cid_3191192
TypeSmall organic molecule
Emp. Form.C27H33N3O3S
Mol. Mass.479.634
SMILESCCOc1cccc(c1)N(C(C(=O)NC1CCCCC1)c1cccn1C)C(=O)Cc1cccs1