Reaction Details
TargetG2/mitotic-specific cyclin-B1
LigandBDBM43760
Substrate/Competitorn/a
Meas. Tech.Counterscreen assay for inhibitors of Wee1 degradation: dose response cell-based assay to identify inhibitors of cyclin B degradation
EC50>49750±n/a nM
Citation PubChem, PC Counterscreen assay for inhibitors of Wee1 degradation: dose response cell-based assay to identify inhibitors of cyclin B degradation PubChem Bioassay(2008)[AID]
 
G2/mitotic-specific cyclin-B1
Name:G2/mitotic-specific cyclin-B1
Type:Enzyme Subunit
Mol. Mass.:48340.95
Organism:Homo sapiens (Human)
Description:P14635
Residue:433
BDBM43760
NameBDBM43760
Synonyms:MLS000565334 N'-(5-bromo-2-keto-indol-3-yl)-2-pyrrol-1-yl-benzohydrazide N'-(5-bromo-2-oxoindol-3-yl)-2-pyrrol-1-ylbenzohydrazide cid_6006008
TypeSmall organic molecule
Emp. Form.C19H13BrN4O2
Mol. Mass.409.236
SMILESBrc1ccc2=NC(=O)C(NNC(=O)c3ccccc3-n3cccc3)=c2c1