Reaction Details
TargetAlkaline phosphatase, tissue-nonspecific isozyme
LigandBDBM43814
Substrate/Competitorn/a
Meas. Tech.SAR assay for compounds activating TNAP in the absence of phosphate acceptor performed in a luminescent assay
EC50<195±n/a nM
Citation PubChem, PC SAR assay for compounds activating TNAP in the absence of phosphate acceptor performed in a luminescent assay PubChem Bioassay(2010)[AID]
 
Alkaline phosphatase, tissue-nonspecific isozyme
Name:Alkaline phosphatase, tissue-nonspecific isozyme
Type:PROTEIN
Mol. Mass.:57306.17
Organism:Homo sapiens (Human)
Description:ChEMBL_1448917
Residue:524
BDBM43814
NameBDBM43814
Synonyms:(3Z)-1-butyl-3-[(2-hydroxyphenyl)hydrazinylidene]-2-indolone (3Z)-1-butyl-3-[(2-hydroxyphenyl)hydrazono]oxindole cid_25199560
TypeSmall organic molecule
Emp. Form.C18H19N3O2
Mol. Mass.309.3624
SMILESCCCCN1C(=O)C(=NNc2ccccc2O)c2ccccc12