Reaction Details
TargetAlkaline phosphatase, tissue-nonspecific isozyme
LigandBDBM43818
Substrate/Competitorn/a
Meas. Tech.SAR assay for compounds activating TNAP in the absence of phosphate acceptor performed in a luminescent assay
EC50 3300±n/a nM
Citation PubChem, PC SAR assay for compounds activating TNAP in the absence of phosphate acceptor performed in a luminescent assay PubChem Bioassay(2010)[AID]
 
Alkaline phosphatase, tissue-nonspecific isozyme
Name:Alkaline phosphatase, tissue-nonspecific isozyme
Type:PROTEIN
Mol. Mass.:57306.17
Organism:Homo sapiens (Human)
Description:ChEMBL_1448917
Residue:524
BDBM43818
NameBDBM43818
Synonyms:(2Z)-3-ethyl-2-[(E)-3-(3-ethyl-5-phenyl-1,3-benzoxazol-3-ium-2-yl)prop-2-enylidene]-5-phenyl-1,3-benzoxazole;ethyl sulfate cid_10864994
TypeSmall organic molecule
Emp. Form.C33H29N2O2
Mol. Mass.485.595
SMILESCCN1\C(Oc2ccc(cc12)-c1ccccc1)=C\C=C\c1oc2ccc(cc2[n+]1CC)-c1ccccc1