Reaction Details
TargetSolute carrier family 12 member 5
LigandBDBM43897
Substrate/Competitorn/a
Meas. Tech.Identification of Novel Modulators of Cl- dependent Transport Process via HTS: Rubidium Flux
IC50 13400±n/a nM
Citation PubChem, PC Identification of Novel Modulators of Cl- dependent Transport Process via HTS: Rubidium Flux PubChem Bioassay(2009)[AID]
 
Solute carrier family 12 member 5
Name:Solute carrier family 12 member 5
Type:PROTEIN
Mol. Mass.:126185.18
Organism:Homo sapiens (Human)
Description:ChEMBL_828024
Residue:1139
BDBM43897
NameBDBM43897
Synonyms:3-(phenylmethyl)sulfonyl-N-(4,5,6,7-tetrahydro-1,3-benzothiazol-2-yl)propanamide 3-benzylsulfonyl-N-(4,5,6,7-tetrahydro-1,3-benzothiazol-2-yl)propionamide cid_2972574
TypeSmall organic molecule
Emp. Form.C17H20N2O3S2
Mol. Mass.364.482
SMILESO=C(CCS(=O)(=O)Cc1ccccc1)Nc1nc2CCCCc2s1