Reaction Details
TargetSolute carrier family 12 member 5
LigandBDBM43432
Substrate/Competitorn/a
Meas. Tech.Identification of Novel Modulators of Cl- dependent Transport Process via HTS; Dose-dependent Assay with KCC2
EC50 878000±n/a nM
Citation PubChem, PC Identification of Novel Modulators of Cl- dependent Transport Process via HTS; Dose-dependent Assay with KCC2 PubChem Bioassay(2009)[AID]
 
Solute carrier family 12 member 5
Name:Solute carrier family 12 member 5
Type:PROTEIN
Mol. Mass.:126185.18
Organism:Homo sapiens (Human)
Description:ChEMBL_828024
Residue:1139
BDBM43432
NameBDBM43432
Synonyms:4-[(4-fluorobenzyl)thio]-2-methyl-5-nitro-1H-imidazole 4-[(4-fluorophenyl)methylthio]-2-methyl-5-nitro-1H-imidazole MLS000677201 cid_801720
TypeSmall organic molecule
Emp. Form.C11H10FN3O2S
Mol. Mass.267.279
SMILESCc1nc(c(SCc2ccc(F)cc2)[nH]1)[N+]([O-])=O