Reaction Details
TargetSolute carrier family 12 member 5
LigandBDBM44116
Substrate/Competitorn/a
Meas. Tech.Identification of Novel Modulators of Cl- dependent Transport Process via HTS; Dose-dependent Assay with KCC2
EC50 182±n/a nM
Citation PubChem, PC Identification of Novel Modulators of Cl- dependent Transport Process via HTS; Dose-dependent Assay with KCC2 PubChem Bioassay(2009)[AID]
 
Solute carrier family 12 member 5
Name:Solute carrier family 12 member 5
Type:PROTEIN
Mol. Mass.:126185.18
Organism:Homo sapiens (Human)
Description:ChEMBL_828024
Residue:1139
BDBM44116
NameBDBM44116
Synonyms:2-[6-(4-fluorophenyl)pyridazin-3-yl]sulfanyl-N-(5-methyl-1,2-oxazol-3-yl)acetamide 2-[[6-(4-fluorophenyl)-3-pyridazinyl]thio]-N-(5-methyl-3-isoxazolyl)acetamide MLS000710099 cid_3228050
TypeSmall organic molecule
Emp. Form.C16H13FN4O2S
Mol. Mass.344.363
SMILESCc1cc(NC(=O)CSc2ccc(nn2)-c2ccc(F)cc2)no1