Reaction Details
TargetSolute carrier family 12 member 5
LigandBDBM44166
Substrate/Competitorn/a
Meas. Tech.Identification of Novel Modulators of Cl- dependent Transport Process via HTS; Dose-dependent Assay with KCC2
EC50 252±n/a nM
Citation PubChem, PC Identification of Novel Modulators of Cl- dependent Transport Process via HTS; Dose-dependent Assay with KCC2 PubChem Bioassay(2009)[AID]
 
Solute carrier family 12 member 5
Name:Solute carrier family 12 member 5
Type:PROTEIN
Mol. Mass.:126185.18
Organism:Homo sapiens (Human)
Description:ChEMBL_828024
Residue:1139
BDBM44166
NameBDBM44166
Synonyms:MLS000858987 N'-(4-phenyl-1,3-thiazol-2-yl)thiophene-2-carbohydrazide N'-(4-phenylthiazol-2-yl)thiophene-2-carbohydrazide cid_2817110
TypeSmall organic molecule
Emp. Form.C14H11N3OS2
Mol. Mass.301.387
SMILESO=C(NNc1nc(cs1)-c1ccccc1)c1cccs1