Reaction Details
TargetEphrin type-A receptor 4
LigandBDBM44436
Substrate/Competitorn/a
Meas. Tech.Counter Screen for Placental Alkaline Phosphatase-based Assays Positives
IC50>50000±0 nM
Citation PubChem, PC Counter Screen for Placental Alkaline Phosphatase-based Assays Positives PubChem Bioassay(2008)[AID]
 
Ephrin type-A receptor 4
Name:Ephrin type-A receptor 4
Type:Enzyme Catalytic Domain
Mol. Mass.:109812.17
Organism:Mus musculus
Description:gi_34328113
Residue:986
BDBM44436
NameBDBM44436
Synonyms:3-phenyl-1-propyl-pyrazolo[4,3-b]quinoxaline MLS000040578 cid_664831
TypeSmall organic molecule
Emp. Form.C18H16N4
Mol. Mass.288.3464
SMILESCCCn1nc(-c2ccccc2)c2nc3ccccc3nc12