Reaction Details
TargetProtein Rev [8-24]
LigandBDBM44538
Substrate/Competitorn/a
Meas. Tech.Dose response biochemical assay to identify inhibitors of the HIV Rev - RRE RNA interaction (disruption of protein-RNA interaction)
IC50>79370±n/a nM
Citation PubChem, PC Dose response biochemical assay to identify inhibitors of the HIV Rev - RRE RNA interaction (disruption of protein-RNA interaction) PubChem Bioassay(2007)[AID]
 
Protein Rev [8-24]
Name:Protein Rev [8-24]
Type:Enzyme Catalytic Domain
Mol. Mass.:2446.81
Organism:Human immunodeficiency virus 1
Description:gi_253722402
Residue:17
TRQARRNRRRRWRERQR
BDBM44538
NameBDBM44538
Synonyms:4-Amino-1-phenothiazin-10-yl-butan-1-one 4-amino-1-phenothiazin-10-yl-butan-1-one;hydrochloride 4-azanyl-1-phenothiazin-10-yl-butan-1-one;hydrochloride SMR000102020 | cid_6603292
TypeSmall organic molecule
Emp. Form.C16H16N2OS
Mol. Mass.284.376
SMILESNCCCC(=O)N1c2ccccc2Sc2ccccc12