Reaction Details
TargetProtein Rev [8-24]
LigandBDBM44542
Substrate/Competitorn/a
Meas. Tech.Dose response biochemical assay to identify inhibitors of the HIV Rev - RRE RNA interaction (disruption of protein-RNA interaction)
IC50>79370±n/a nM
Citation PubChem, PC Dose response biochemical assay to identify inhibitors of the HIV Rev - RRE RNA interaction (disruption of protein-RNA interaction) PubChem Bioassay(2007)[AID]
 
Protein Rev [8-24]
Name:Protein Rev [8-24]
Type:Enzyme Catalytic Domain
Mol. Mass.:2446.81
Organism:Human immunodeficiency virus 1
Description:gi_253722402
Residue:17
TRQARRNRRRRWRERQR
BDBM44542
NameBDBM44542
Synonyms:(1-bicyclo[2.2.1]hept-2-ylethyl)[4-(dimethylamino)benzyl]amine hydrochloride 4-[[1-(3-bicyclo[2.2.1]heptanyl)ethylamino]methyl]-N,N-dimethylaniline;hydrochloride SMR000143823 dimethyl-[4-[[1-(2-norbornyl)ethylamino]methyl]phenyl]amine;hydrochloride
TypeSmall organic molecule
Emp. Form.C18H28N2
Mol. Mass.272.4283
SMILES[H]C12CCC([H])(C1)C(C2)C(C)NCc1ccc(cc1)N(C)C