Reaction Details
TargetProtein Rev [8-24]
LigandBDBM44544
Substrate/Competitorn/a
Meas. Tech.Dose response biochemical assay to identify inhibitors of the HIV Rev - RRE RNA interaction (disruption of protein-RNA interaction)
IC50>79370±n/a nM
Citation PubChem, PC Dose response biochemical assay to identify inhibitors of the HIV Rev - RRE RNA interaction (disruption of protein-RNA interaction) PubChem Bioassay(2007)[AID]
 
Protein Rev [8-24]
Name:Protein Rev [8-24]
Type:Enzyme Catalytic Domain
Mol. Mass.:2446.81
Organism:Human immunodeficiency virus 1
Description:gi_253722402
Residue:17
TRQARRNRRRRWRERQR
BDBM44544
NameBDBM44544
Synonyms:2-(4-methoxyphenyl)ethyl-[3-(4-methoxyphenyl)-1-methyl-propyl]amine 4-(4-methoxyphenyl)-N-[2-(4-methoxyphenyl)ethyl]butan-2-amine SMR000140380 | cid_2846243
TypeSmall organic molecule
Emp. Form.C20H27NO2
Mol. Mass.313.4339
SMILESCOc1ccc(CCNC(C)CCc2ccc(OC)cc2)cc1