Reaction Details
TargetProtein Rev [8-24]
LigandBDBM44547
Substrate/Competitorn/a
Meas. Tech.Dose response biochemical assay to identify inhibitors of the HIV Rev - RRE RNA interaction (disruption of protein-RNA interaction)
IC50>79370±n/a nM
Citation PubChem, PC Dose response biochemical assay to identify inhibitors of the HIV Rev - RRE RNA interaction (disruption of protein-RNA interaction) PubChem Bioassay(2007)[AID]
 
Protein Rev [8-24]
Name:Protein Rev [8-24]
Type:Enzyme Catalytic Domain
Mol. Mass.:2446.81
Organism:Human immunodeficiency virus 1
Description:gi_253722402
Residue:17
TRQARRNRRRRWRERQR
BDBM44547
NameBDBM44547
Synonyms:2-N-(3-methoxyphenyl)-6-(3-methyl-1-benzofuran-2-yl)-1,3,5-triazine-2,4-diamine N-(3-Methoxy-phenyl)-6-(3-methyl-benzofuran-2-yl)-[1,3,5]triazine-2,4-diamine N2-(3-methoxyphenyl)-6-(3-methyl-2-benzofuranyl)-1,3,5-triazine-2,4-diamine [4-amino-6-(3-methylbenzofuran-2-yl)-s-triazin-2-yl]-(3-methoxyphenyl)amine | cid_1850707
TypeSmall organic molecule
Emp. Form.C19H17N5O2
Mol. Mass.347.3706
SMILESCOc1cccc(Nc2nc(N)nc(n2)-c2oc3ccccc3c2C)c1