Reaction Details
TargetProtein Rev [8-24]
LigandBDBM44551
Substrate/Competitorn/a
Meas. Tech.Dose response biochemical assay to identify inhibitors of the HIV Rev - RRE RNA interaction (disruption of protein-RNA interaction)
IC50>79370±n/a nM
Citation PubChem, PC Dose response biochemical assay to identify inhibitors of the HIV Rev - RRE RNA interaction (disruption of protein-RNA interaction) PubChem Bioassay(2007)[AID]
 
Protein Rev [8-24]
Name:Protein Rev [8-24]
Type:Enzyme Catalytic Domain
Mol. Mass.:2446.81
Organism:Human immunodeficiency virus 1
Description:gi_253722402
Residue:17
TRQARRNRRRRWRERQR
BDBM44551
NameBDBM44551
Synonyms:4-(4-Amino-phenylazo)-5-methyl-2-phenyl-2,4-dihydro-pyrazol-3-one 4-(4-aminophenyl)azo-5-methyl-2-phenyl-4H-pyrazol-3-one MLS000566457 cid_3108928
TypeSmall organic molecule
Emp. Form.C16H15N5O
Mol. Mass.293.3232
SMILESCc1[nH]n(-c2ccccc2)c(=O)c1N=Nc1ccc(N)cc1