Reaction Details
TargetMultidrug resistance-associated protein 1
LigandBDBM38912
Substrate/Competitorn/a
Meas. Tech.Identification of Molecular Probes that Activate MRP-1 - Dose Response
EC50<195±n/a nM
Citation PubChem, PC Identification of Molecular Probes that Activate MRP-1 - Dose Response PubChem Bioassay(2007)[AID]
 
Multidrug resistance-associated protein 1
Name:Multidrug resistance-associated protein 1
Type:n/a
Mol. Mass.:171597.72
Organism:Homo sapiens (Human)
Description:P33527
Residue:1531
BDBM38912
NameBDBM38912
Synonyms:7-(6-amino-3-azabicyclo[3.1.0]hexan-3-yl)-1-(2,4-difluorophenyl)-6-fluoro-4-keto-1,8-naphthyridine-3-carboxylic acid;mesylic acid 7-(6-azanyl-3-azabicyclo[3.1.0]hexan-3-yl)-1-[2,4-bis(fluoranyl)phenyl]-6-fluoranyl-4-oxidanylidene-1,8-naphthyridine-3-carboxylic acid;methanesulfonic acid SMR000057550 | cid_665294
TypeSmall organic molecule
Emp. Form.C20H15F3N4O3
Mol. Mass.416.3533
SMILESNC1C2CN(CC12)c1nc2n(cc(C(O)=O)c(=O)c2cc1F)-c1ccc(F)cc1F